collège universitaire
created: 2011-09-01T00:00:00+02:00
modified: 2014-09-22T17:45:22+02:00
status: 1
type: Concept
broader: T96-329
definition: Maison destinée primitivement à héberger les étudiants fréquentant l'Université. Dès le XIIIe siècle, les collèges universitaires deviennent également des édifices d'enseignement.
in scheme: T96