amphithéâtre d'enseignement
created: 2011-09-01T00:00:00+02:00
modified: 2014-12-08T11:31:59+01:00
status: 1
type: Concept
alternative label: amphithéâtre universitaire
broader: T96-334
definition: Grande pièce garnie de gradins, où les professeurs donnent leurs cours.
in scheme: T96
preferred label: lecture halls @en-us