ensemble de culture recherche sport ou loisir
created: 2011-09-01T00:00:00+02:00
modified: 2013-04-23T00:00:00+02:00
status: 1
type: Concept
broader: T96-338
definition: Complexe regroupant des constructions consacrées aux activités culturelles, sportives, de recherche ou de loisir.
in scheme: T96
narrower: T96-340
narrower: T96-341
narrower: T96-342
narrower: T96-343
narrower: T96-344
narrower: T96-345