édifice et aménagement de culture recherche sport ou loisir
created: 2011-09-01T00:00:00+02:00
modified: 2013-04-23T00:00:00+02:00
status: 1
type: Concept
broader: T96-338
definition: Espace, construction ou groupe de constructions accueillant ou abritant des activités culturelles, sportives, de recherche ou de loisirs.
in scheme: T96
narrower: T96-347
narrower: T96-348
narrower: T96-349
narrower: T96-353
narrower: T96-354
narrower: T96-355
narrower: T96-356
narrower: T96-357
narrower: T96-358
narrower: T96-359
narrower: T96-362
narrower: T96-380
narrower: T96-384
narrower: T96-385
narrower: T96-393
narrower: T96-397
narrower: T96-402
narrower: T96-403
narrower: T96-404
narrower: T96-405
narrower: T96-406
narrower: T96-407
narrower: T96-408
narrower: T96-410
narrower: T96-420
narrower: T96-421