aire de jeux
created: 2011-09-01T00:00:00+02:00
modified: 2014-10-17T15:45:35+02:00
status: 1
type: Concept
broader: T96-346
definition: Surface libre d'assez petites dimensions aménagée pour les jeux d’enfants.
in scheme: T96
preferred label: playgrounds @en-us