centre d'archives
created: 2011-09-01T00:00:00+02:00
modified: 2014-12-12T14:40:02+01:00
status: 1
type: Concept
broader: T96-346
definition: Édifice où sont déposées, classées et conservées les archives ou collections de pièces et documents anciens. Il peut abriter une salle de consultation.
in scheme: T96
preferred label: archives (buildings) @en-us