bibliothèque
created: 2011-09-01T00:00:00+02:00
modified: 2014-12-12T14:32:30+01:00
status: 1
type: Concept
alternative label: médiathèque
broader: T96-346
definition: Édifice ou partie d'édifice réservé au rangement, au catalogage et à la consultation des livres, des périodiques et autres médias.
in scheme: T96
preferred label: libraries (buildings) @en-us
scope note: Dans l'architecture médiévale, cette construction s'appelle librairie.