casino
created: 2011-09-01T00:00:00+02:00
modified: 2014-12-12T14:33:58+01:00
status: 1
type: Concept
alternative label: salle de jeu
broader: T96-346
definition: Établissement de jeux d’argent et de hasard pourvu ou non d’une salle de spectacle.
in scheme: T96
preferred label: gambling casinos @en-us