secteur urbain concerté
created: 2011-09-01T00:00:00+02:00
modified: 2015-01-09T12:11:26+01:00
status: 1
type: Concept
broader: T96-20
definition: Partie d'une agglomération constituée par un ensemble concerté d'édifices, d’éléments de voirie et de différents équipements.
in scheme: T96
narrower: T96-36
narrower: T96-37
preferred label: comparto edilizio @it