grand ensemble
created: 2011-09-01T00:00:00+02:00
modified: 2015-01-09T11:13:54+01:00
status: 1
type: Concept
alternative label: cité
alternative label: zone d'aménagement concerté
alternative label: zone d'urbanisation prioritaire
broader: T96-35
definition: Aménagement urbain comportant plusieurs bâtiments isolés pouvant prendre la forme de barres ou de tours, et éventuellement un ou plusieurs ensembles d'habitats individuels et des équipements divers.
in scheme: T96
scope note: N'étant pas subdivisé en lots, le grand ensemble ne peut pas constituer un lotissement.