établissement nautique
created: 2011-09-01T00:00:00+02:00
modified: 2014-12-12T14:56:51+01:00
status: 1
type: Concept
broader: T96-362
definition: Édifice et aménagements destinés à la pratique d'un sport nautique ou à la navigation de plaisance.
in scheme: T96