parcours de golf
terme associe: T96-430
created: 2011-09-01T00:00:00+02:00
modified: 2014-12-12T15:27:56+01:00
status: 1
type: Concept
broader: T96-362
definition: Espace et installations destinés à la pratique du golf.
in scheme: T96
preferred label: golf courses @en-us
related: T96-430