lotissement
terme associe: T96-504
created: 2011-09-01T00:00:00+02:00
modified: 2015-01-09T12:08:54+01:00
status: 1
type: Concept
broader: T96-35
definition: Parcelle ou fonds de parcelle divisé en plusieurs lots, en vue de la vente, de la location ou de la concession.
in scheme: T96
narrower: T96-38
narrower: T96-39
related: T96-504