manège
created: 2011-09-01T00:00:00+02:00
modified: 2014-12-12T15:26:33+01:00
status: 1
type: Concept
broader: T96-362
definition: Lieu couvert où l'on dresse les chevaux et où l'on enseigne l'équitation.
in scheme: T96
preferred label: riding halls @en-us
scope note: Ne pas appeler manège l'emplacement d'un moteur à énergie animale.