salle d'armes
created: 2011-09-01T00:00:00+02:00
modified: 2014-10-10T10:15:35+02:00
status: 1
type: Concept
broader: T96-362
definition: Local où l'on enseigne et où l'on pratique l'escrime.
in scheme: T96
preferred label: fencing rooms @en-us