stade
created: 2011-09-01T00:00:00+02:00
modified: 2014-12-18T15:08:32+01:00
status: 1
type: Concept
alternative label: stade d'athlétisme
alternative label: stade de football
alternative label: terrain de rugby
alternative label: terrain de sport
broader: T96-362
definition: Terrain de sport rectangulaire ou ovale, qui peut être ceint d'une piste de course et bordé de tribunes pour le public, de vestiaires pour les sportifs. Il est destiné soit à des exercices d'athlétisme, soit à des épreuves sportives par équipes comme le football ou le rugby.
in scheme: T96
preferred label: stadiums @en-us