bains publics
created: 2011-09-01T00:00:00+02:00
modified: 2014-12-18T15:10:53+01:00
status: 1
type: Concept
broader: T96-380
definition: Établissement d'hygiène permettant à la clientèle de se laver, de se détendre et de laver son linge.
in scheme: T96
narrower: T96-382
preferred label: public baths @en-us