bains douches
created: 2011-09-01T00:00:00+02:00
modified: 2014-10-10T10:24:51+02:00
status: 1
type: Concept
broad match: cb11978599h
broad match: http://vocab.getty.edu/aat/300007353
broader: T96-381
definition: Bains publics municipaux, où l'on vient essentiellement pour se laver.
in scheme: T96