laboratoire
created: 2011-09-01T00:00:00+02:00
modified: 2014-12-19T10:19:45+01:00
status: 1
type: Concept
alternative label: bassin d'essais
alternative label: laboratoire d'essais
broader: T96-385
definition: Bâtiment, local ou espace libre où l'on effectue les expériences, mesures, essais pour l'industrie, la recherche, l'enseignement, etc.
in scheme: T96
preferred label: laboratories @en-us