observatoire
created: 2011-09-01T00:00:00+02:00
modified: 2014-12-19T10:21:10+01:00
status: 1
type: Concept
alternative label: observatoire astronomique
broader: T96-385
definition: Établissement de recherche abritant les services et l’instrumentation nécessaires aux observations, mesures et analyses en astronomie (astrométrie, astrophysique, etc.) et/ou en géophysique (météorologie, géomagnétisme, sismologie, etc.).
in scheme: T96
narrower: T96-388
narrower: T96-389
narrower: T96-390
narrower: T96-391
narrower: T96-392
preferred label: observatories @en-us
scope note: Pour étudier l’instrumentation, voir le Thesaurus des objets mobiliers.