abri d'instrument équatorial
created: 2011-09-01T00:00:00+02:00
modified: 2014-12-19T10:23:01+01:00
status: 1
type: Concept
alternative label: coupole d'observatoire
broader: T96-387
definition: Ouvrage isolé ou partie d'un observatoire astronomique au centre duquel est placé un instrument fixe, lunette ou télescope, permettant de suivre le mouvement des astres. Pour permettre à l'instrument de pointer et de suivre un astre, quelles que soient ses positions initiale et successives, cet ouvrage est le plus souvent couvert d'un dôme hémisphérique mobile possédant une ouverture verticale occultable par des panneaux à glissières.
in scheme: T96