abri d'instrument méridien
created: 2011-09-01T00:00:00+02:00
modified: 2014-12-19T10:24:34+01:00
status: 1
type: Concept
broader: T96-387
definition: Ouvrage isolé ou partie d'un observatoire astronomique où sont placés un ou plusieurs instruments permettant d'observer l'heure de passage ou la hauteur d'un astre au moment où celui-ci franchit le méridien du lieu. Pour permettre à l'instrument d'observer le ciel dans le plan méridien, les murs nord et sud sont percés sur toute leur hauteur de baies verticales prolongées dans la couverture par une ouverture zénithale couverte d'un toit amovible.
in scheme: T96
scope note: À cet ouvrage sont souvent associées des mires qui permettent, par contrôle, de positionner l'instrument d'observation.