marégraphe
created: 2011-09-01T00:00:00+02:00
modified: 2014-10-10T10:48:03+02:00
status: 1
type: Concept
broader: T96-387
definition: Édifice ou édicule abritant l'instrumentation nécessaire à la mesure du niveau de la mer et des hauteurs d'eau consécutives aux marées.
in scheme: T96
preferred label: tide gages @en-us
scope note: Pour étudier l’instrumentation de mesure et d'enregistrement, voir le Thesaurus des objets mobiliers.