station météorologique
created: 2011-09-01T00:00:00+02:00
modified: 2014-12-19T10:26:08+01:00
status: 1
type: Concept
broader: T96-387
definition: Édifice, édicule ou local abritant l’instrumentation nécessaire à l’observation et la mesure des phénomènes atmosphériques tels que les nuages, les précipitations, le vent, etc.
in scheme: T96
preferred label: meteorological stations @en-us
scope note: Pour étudier l’instrumentation de mesure et d'enregistrement (thermomètres, baromètres, hygromètres, etc.), voir le Thesaurus des objets mobiliers.