salle d'exposition
created: 2011-09-01T00:00:00+02:00
modified: 2014-10-17T16:04:18+02:00
status: 1
type: Concept
broad match: http://vocab.getty.edu/aat/300005748
broader: T96-393
definition: Partie d'édifice destinée à la présentation publique d’œuvres d'art.
in scheme: T96