lieu de production médiatique
created: 2011-09-01T00:00:00+02:00
modified: 2013-04-23T00:00:00+02:00
status: 1
type: Concept
broader: T96-346
definition: Édifice ou partie d'édifice abritant des activités relevant de la production médiatique.
in scheme: T96
narrower: T96-398
narrower: T96-400
narrower: T96-401