maison de quartier
created: 2011-09-01T00:00:00+02:00
modified: 2014-12-19T10:36:25+01:00
status: 1
type: Concept
broader: T96-346
definition: Édifice ou partie d'édifice destiné à abriter des services municipaux liés aux loisirs et des locaux pour les associations.
in scheme: T96