plage aménagée
terme associe: T96-1056
created: 2011-09-01T00:00:00+02:00
modified: 2014-12-19T10:48:35+01:00
status: 1
type: Concept
alternative label: plage artificielle
broader: T96-346
definition: Plage d’origine naturelle ou non dont le traitement des abords, des accès et l'installation de commodités diverses permettent d’accueillir le public.
in scheme: T96
related: T96-1056