salle de billard
created: 2011-09-01T00:00:00+02:00
modified: 2014-12-19T10:54:51+01:00
status: 1
type: Concept
broader: T96-346
definition: Partie d'édifice abritant une ou plusieurs tables et leurs accessoires destinés au jeu de billard.
in scheme: T96
preferred label: billiard rooms @en-us