salle paroissiale
terme associe: T96-81
created: 2011-09-01T00:00:00+02:00
modified: 2014-12-19T10:56:25+01:00
status: 1
type: Concept
broader: T96-408
definition: Bâtiment destiné à accueillir les activités sociales ou culturelles de la paroisse. Il est souvent situé dans le même enclos que l'église ou le presbytère.
in scheme: T96
preferred label: parish houses @en-us
related: T96-81