courée
created: 2011-09-01T00:00:00+02:00
modified: 2015-01-09T11:25:02+01:00
status: 1
type: Concept
broader: T96-39
definition: Lotissement d'habitations populaires formé généralement de séries de petits logements placés de part et d'autre d'une rue intérieure ou d'une cour commune.
in scheme: T96