plongeoir
terme associe: T96-429
created: 2011-09-01T00:00:00+02:00
modified: 2014-10-17T15:40:12+02:00
status: 1
type: Concept
broad match: http://vocab.getty.edu/aat/300222065
broader: T96-422
definition: Tremplin ou plate-forme plus ou moins haute, au-dessus d'une piscine ou d'un plan d'eau aménagé, permettant de plonger.
in scheme: T96
related: T96-429