poste d'affût
created: 2011-09-01T00:00:00+02:00
modified: 2014-10-17T15:44:30+02:00
status: 1
type: Concept
broad match: http://vocab.getty.edu/aat/300387322
broader: T96-422
definition: Abri dissimulé dans la végétation permettant d'observer la faune et, pour les chasseurs, de tirer le gibier.
in scheme: T96
scope note: Ne pas confondre avec mirador, ni avec poste d’observation.