table d'orientation
created: 2011-09-01T00:00:00+02:00
modified: 2014-10-09T13:07:00+02:00
status: 1
type: Concept
broader: T96-422
definition: Ouvrage, généralement en maçonnerie, en forme de table habituellement semi-circulaire, placé à un point de vue et portant l'indication des sites qu'on aperçoit depuis cet ouvrage.
in scheme: T96
preferred label: viewpoint indicator @en-us