partie d'édifice de culture recherche sport ou loisir
created: 2011-09-01T00:00:00+02:00
modified: 2013-04-23T00:00:00+02:00
status: 1
type: Concept
broader: T96-338
definition: Espace intérieur d’un édifice culturel, sportif, de recherche ou de loisir, ou construction qui lui est associée.
in scheme: T96
narrower: T96-429
narrower: T96-430
narrower: T96-431
narrower: T96-432
narrower: T96-433
narrower: T96-434