club-house
terme associe: T96-368
terme associe: T96-378
created: 2011-09-01T00:00:00+02:00
modified: 2014-12-19T11:24:30+01:00
status: 1
type: Concept
broader: T96-428
definition: Bâtiment réservé aux membres d'un club sportif.
in scheme: T96
related: T96-368
related: T96-378
scope note: Ne pas confondre avec cercle.