piste d'athlétisme
created: 2011-09-01T00:00:00+02:00
modified: 2014-10-10T12:21:21+02:00
status: 1
type: Concept
broader: T96-428
definition: Aire couverte ou découverte aménagée pour la course, le saut et le lancer.
in scheme: T96
preferred label: running tracks @en-us