base aérienne
created: 2011-09-01T00:00:00+02:00
modified: 2015-01-05T11:59:50+01:00
status: 1
type: Concept
broader: T96-437
definition: Base militaire dédiée aux forces aériennes et comprenant un aérodrome.
in scheme: T96
preferred label: air bases @en-us