base navale
created: 2011-09-01T00:00:00+02:00
modified: 2015-01-05T12:01:17+01:00
status: 1
type: Concept
broader: T96-437
definition: Base militaire dédiée aux forces navales et comprenant un port.
in scheme: T96
narrower: T96-440
preferred label: naval bases @en-us