fortification
created: 2011-09-01T00:00:00+02:00
modified: 2014-10-14T15:56:16+02:00
status: 1
type: Concept
alternative label: ensemble fortifié
broader: T96-436
definition: Ensemble formé d'édifices ou d'ouvrages défensifs.
in scheme: T96
narrower: T96-444
narrower: T96-446
narrower: T96-447
narrower: T96-448