ligne fortifiée
created: 2011-09-01T00:00:00+02:00
modified: 2015-01-05T12:13:19+01:00
status: 1
type: Concept
broad match: cb11931504g
broader: T96-443
definition: Ensemble constitué par des ouvrages fortifiés disposés sur l'alignement d'un front ou sur une ligne frontière (ex. : la ligne Maginot, le mur de l'Atlantique).
in scheme: T96
preferred label: coastal fortifications & field fortifications @en-us