édifice militaire
created: 2011-09-01T00:00:00+02:00
modified: 2015-01-05T11:57:11+01:00
status: 1
type: Concept
broader: T96-435
definition: Édifice lié à la surveillance et à la défense d'un territoire.
in scheme: T96
narrower: T96-451
narrower: T96-457