château fort
terme associe: T96-516
terme associe: T96-521
created: 2011-09-01T00:00:00+02:00
modified: 2015-01-05T11:06:45+01:00
status: 1
type: Concept
broader: T96-451
definition: Dans l'architecture médiévale, demeure seigneuriale fortifiée.
in scheme: T96
related: T96-516
related: T96-521
scope note: Ne pas appeler château fort un château présentant des éléments de fortification décoratifs ou à mission défensive limitée. Ne pas confondre avec fort, ni avec forteresse.