arsenal
created: 2011-09-01T00:00:00+02:00
modified: 2015-01-05T11:31:14+01:00
status: 1
type: Concept
broader: T96-457
definition: Atelier de fabrication et de réparation ou simple dépôt pour les armes et les munitions. L'arsenal est un local compris dans un ensemble ou un édifice, fortifié ou non. Dans le domaine maritime, établissement d'État chargé de la construction, de l'entretien et de la réparation des navires.
in scheme: T96
preferred label: arsenals @en-us