gendarmerie
created: 2011-09-01T00:00:00+02:00
modified: 2015-01-05T11:41:05+01:00
status: 1
type: Concept
broader: T96-459
definition: Édifice destiné aux bureaux et logements des gendarmes.
in scheme: T96
preferred label: policestations @en-us