magasin de fourrage
created: 2011-09-01T00:00:00+02:00
modified: 2015-01-05T11:46:18+01:00
status: 1
type: Concept
alternative label: entrepôt militaire de fourrage
broader: T96-457
definition: Édifice ou partie d'édifice où est entreposé le fourrage destiné à l'alimentation des chevaux de l'armée.
in scheme: T96