magasin de munitions
created: 2011-09-01T00:00:00+02:00
modified: 2015-01-05T11:47:17+01:00
status: 1
type: Concept
alternative label: dépôt de munitions
alternative label: entrepôt de munitions
broader: T96-457
definition: Édifice ou partie d'édifice où sont entreposés les projectiles des armes à feu.
in scheme: T96
preferred label: magazines @en-us