station radar
terme associe: T96-1107
created: 2011-09-01T00:00:00+02:00
modified: 2015-01-05T11:50:15+01:00
status: 1
type: Concept
broad match: http://vocab.getty.edu/aat/300235030
broader: T96-457
definition: Poste équipé d'un appareil radar pour le guidage des appareils en mer ou des avions en vol, ou bien pour leur détection.
in scheme: T96
related: T96-1107
scope note: Pour étudier les équipements (antenne radar, générateur, etc.) voir le Thesaurus des objets mobiliers.