campement
created: 2011-09-01T00:00:00+02:00
modified: 2014-12-31T13:51:13+01:00
status: 1
type: Concept
broader: T96-504
definition: Espace accueillant des unités d’habitation démontables ou mobiles.
in scheme: T96