édifice domestique
created: 2011-09-01T00:00:00+02:00
modified: 2013-04-23T00:00:00+02:00
status: 1
type: Concept
alternative label: édifice d'habitation
broader: T96-503
definition: Construction ou groupe de constructions lié au logement et aux activités domestiques.
in scheme: T96
narrower: T96-508
narrower: T96-515